seqn,qsmk,death,yrdth,modth,dadth,sbp,dbp,sex,age,race,income,marital,school,education,ht,wt71,wt82,wt82_71,birthplace,smokeintensity,smkintensity82_71,smokeyrs,asthma,bronch,tb,hf,hbp,pepticulcer,colitis,hepatitis,chroniccough,hayfever,diabetes,polio,tumor,nervousbreak,alcoholpy,alcoholfreq,alcoholtype,alcoholhowmuch,pica,headache,otherpain,weakheart,allergies,nerves,lackpep,hbpmed,boweltrouble,wtloss,infection,active,exercise,birthcontrol,pregnancies,cholesterol,hightax82,price71,price82,tax71,tax82,price71_82,tax71_82
233,0,0,,,,175,96,0,42,1,19,2,7,1,174.1875,79.04,68.94604024,-10.09395976,47,30,-10,29,0,0,0,0,1,1,0,0,0,0,1,0,0,0,1,1,3,7,0,1,0,0,0,0,0,1,0,0,0,0,2,2,,197,0,2.18359375,1.739990234,1.102294922,0.461975098,0.443786621,0.640380859
235,0,0,,,,123,80,0,36,0,18,2,9,2,159.375,58.63,61.23496995,2.60496995,42,20,-10,24,0,0,0,0,0,0,0,0,0,0,0,0,0,0,1,0,1,4,0,1,0,0,0,0,0,0,0,0,1,0,0,2,,301,0,2.346679688,1.797363281,1.364990234,0.571899414,0.549316406,0.79296875
244,0,0,,,,115,75,1,56,1,15,3,11,2,168.5,56.81,66.22448602,9.41448602,51,20,-14,26,0,0,0,0,0,0,0,0,0,1,0,0,1,0,1,3,4,,0,1,1,0,0,1,0,0,0,0,0,0,2,0,2,157,0,1.569580078,1.513427734,0.551269531,0.230987549,0.05619812,0.320251465
245,0,1,85,2,14,148,78,0,68,1,15,3,5,1,170.1875,59.42,64.41011654,4.99011654,37,3,4,53,0,0,0,0,1,0,0,0,0,0,0,0,0,0,1,2,3,4,0,0,1,1,0,0,0,0,0,0,0,1,2,2,,174,0,1.506591797,1.451904297,0.524902344,0.219970703,0.054794312,0.304992676
252,0,0,,,,118,77,0,40,0,18,2,11,2,181.875,87.09,92.07925111,4.98925111,42,20,0,19,0,0,0,0,0,0,0,0,0,0,0,0,0,0,1,2,1,2,0,1,0,0,0,0,0,0,1,0,0,1,1,2,,216,0,2.346679688,1.797363281,1.364990234,0.571899414,0.549316406,0.79296875
257,0,0,,,,141,83,1,43,1,11,4,9,2,162.1875,99,103.4190604,4.41906036,34,10,10,21,0,0,0,0,0,0,0,0,0,0,0,0,0,0,1,3,2,1,0,1,0,0,0,0,0,0,0,0,0,1,1,0,1,212,1,2.209960938,2.025878906,1.154785156,0.747924805,0.184082031,0.406982422
262,0,0,,,,132,69,1,56,0,19,2,12,3,161.5,63.05,58.9670081,-4.0829919,,20,0,39,0,0,0,0,0,0,0,0,0,0,1,0,0,0,1,1,3,4,0,1,0,0,0,1,0,0,0,0,0,0,1,0,1,205,,,,,,,
266,0,0,,,,100,53,1,29,0,22,2,12,3,172.6875,58.74,58.9670081,0.2270081,,2,1,9,0,0,0,0,0,0,0,0,0,0,0,0,0,0,1,0,2,1,0,1,0,0,0,1,0,0,0,0,0,0,2,0,2,166,,,,,,,
419,0,1,84,10,13,163,79,0,51,0,18,2,10,2,166.875,64.86,62.14215469,-2.71784531,42,25,-10,37,0,0,0,0,0,0,0,0,0,0,0,0,0,0,1,1,3,2,0,1,1,0,0,0,0,0,0,0,0,2,2,2,,337,0,2.346679688,1.797363281,1.364990234,0.571899414,0.549316406,0.79296875
420,0,1,86,10,17,184,106,0,43,0,16,2,11,2,175,62.26,72.12118683,9.86118683,42,20,-20,25,0,0,0,0,0,0,0,1,0,0,0,0,0,0,1,0,1,6,0,1,0,0,0,0,0,0,0,0,0,1,2,2,,279,0,2.346679688,1.797363281,1.364990234,0.571899414,0.549316406,0.79296875
428,1,0,,,,135,89,0,43,0,19,2,12,3,176.59375,63.96,79.83225712,15.87225712,42,30,-30,24,0,0,0,0,0,0,0,0,0,0,0,0,0,0,1,3,3,2,0,0,0,0,0,0,0,0,0,0,0,1,1,2,,173,0,2.346679688,1.797363281,1.364990234,0.571899414,0.549316406,0.79296875
431,0,1,92,11,28,118,69,0,34,0,18,2,12,3,186.875,85.28,83.46099608,-1.81900392,42,40,-10,20,0,0,0,0,0,1,0,0,0,0,0,0,0,0,1,0,1,6,0,1,0,0,0,0,0,0,0,0,0,0,2,2,,150,0,2.346679688,1.797363281,1.364990234,0.571899414,0.549316406,0.79296875
434,0,0,,,,127,80,1,54,0,16,3,8,1,156.78125,61.58,62.14215469,0.56215469,,20,-5,19,0,1,0,0,1,0,0,0,0,0,0,0,0,0,1,0,1,1,0,1,0,0,0,0,0,0,0,0,0,1,2,0,2,268,,,,,,,
443,0,0,,,,168,105,1,51,1,,2,12,3,157.875,111.02,111.1301307,0.11013065,42,10,0,38,0,0,0,0,1,0,0,0,0,0,0,0,0,0,0,4,4,,0,0,0,0,1,0,0,0,0,0,0,1,1,0,,234,0,2.346679688,1.797363281,1.364990234,0.571899414,0.549316406,0.79296875
446,1,1,88,1,3,141,79,1,71,0,17,2,0,1,147.09375,75.64,56.69904625,-18.94095375,,40,-40,41,0,1,0,0,0,0,0,0,1,0,0,0,0,0,0,4,4,,0,1,1,0,0,0,0,0,1,0,0,1,1,0,15,229,,,,,,,
455,0,0,,,,128,71,1,47,0,20,2,12,3,161.78125,64.07,69.39963261,5.32963261,42,10,0,24,0,0,0,0,0,0,0,0,0,0,0,0,0,0,1,3,3,3,0,0,0,0,0,0,0,0,0,0,0,0,0,0,3,269,0,2.346679688,1.797363281,1.364990234,0.571899414,0.549316406,0.79296875
457,0,0,,,,126,68,0,56,0,19,2,12,3,169,76.66,77.1107029,0.4507029,5,20,0,44,0,0,0,0,0,0,0,0,0,0,1,0,0,0,1,2,3,2,0,1,0,0,0,0,0,0,0,0,0,0,2,2,,270,0,2.314941406,1.803955078,1.351806641,0.56640625,0.511230469,0.78527832
596,1,0,,,,151,80,1,48,0,18,2,12,3,164,62.03,70.30681735,8.27681735,36,2,-2,30,0,0,1,0,0,0,0,0,0,0,0,0,0,0,1,1,2,1,0,1,0,0,0,0,0,0,0,0,0,1,1,0,3,225,0,2.241699219,1.828125,1.049804688,0.505981445,0.413574219,0.543945313
603,0,1,89,9,1,166,74,0,47,0,19,2,12,3,168,81.19,87.99691978,6.80691978,36,20,0,27,0,0,0,0,1,1,0,0,0,0,0,0,0,0,1,0,1,4,0,0,0,0,0,0,0,0,0,0,0,0,0,2,,233,0,2.241699219,1.828125,1.049804688,0.505981445,0.413574219,0.543945313
604,0,0,,,,129,81,1,47,0,18,2,11,2,158.1875,65.54,69.39963261,3.85963261,36,12,-2,31,0,0,0,0,0,0,0,0,0,0,0,0,0,0,1,2,3,2,0,1,0,0,1,1,0,0,0,0,1,1,1,0,4,285,0,2.241699219,1.828125,1.049804688,0.505981445,0.413574219,0.543945313
605,0,0,,,,114,63,0,25,0,18,2,12,3,179.875,73.48,74.38914868,0.90914868,36,20,-5,7,0,0,0,0,0,0,0,0,0,0,0,0,0,0,1,0,1,2,0,1,0,0,0,0,0,0,0,0,0,0,0,2,,224,0,2.241699219,1.828125,1.049804688,0.505981445,0.413574219,0.543945313
616,0,0,,,,131,79,1,38,0,18,2,12,3,165.375,81.53,67.58526313,-13.94473687,50,20,0,18,0,0,0,0,0,0,0,0,0,0,0,0,0,0,1,0,1,1,0,0,0,0,0,0,0,0,0,0,0,0,0,0,4,234,0,2.099609375,1.693847656,1.049804688,0.439941406,0.405944824,0.609985352
618,1,0,,,,125,71,1,56,1,20,2,12,3,150.78125,60.78,70.76040972,9.98040972,,20,-20,11,0,0,0,0,0,0,0,0,0,0,0,0,0,0,1,3,4,,0,1,0,0,0,0,0,0,0,0,0,0,2,0,4,230,,,,,,,
619,0,0,,,,122,86,0,28,0,19,2,17,5,172.78125,70.87,77.1107029,6.2407029,,30,-10,8,0,0,0,0,0,0,0,0,0,0,0,0,0,0,1,0,2,1,0,1,1,0,0,1,0,0,0,0,0,0,0,2,,161,,,,,,,
620,0,0,,,,142,48,0,60,0,19,6,13,4,181.09375,62.48,60.78137758,-1.69862242,,40,0,39,0,0,0,0,0,0,0,1,0,0,0,0,0,0,1,1,1,3,0,0,0,0,0,0,0,0,0,0,0,0,0,2,,220,,,,,,,
804,0,0,,,,119,72,1,27,0,14,6,10,2,175.5,131.54,126.0986789,-5.44132114,42,40,-20,10,0,0,0,0,0,0,0,0,1,0,0,0,0,0,1,1,1,14,0,1,1,0,0,1,0,0,0,1,1,2,2,1,1,129,0,2.346679688,1.797363281,1.364990234,0.571899414,0.549316406,0.79296875
806,1,0,,,,144,76,0,47,0,22,2,17,5,179.78125,94.35,104.7798375,10.42983747,42,30,-30,23,0,0,0,0,0,0,0,0,0,0,0,0,0,0,1,3,2,1,0,0,0,0,0,0,0,0,0,0,0,0,0,2,,328,0,2.346679688,1.797363281,1.364990234,0.571899414,0.549316406,0.79296875
813,0,1,85,12,5,161,84,0,53,0,18,2,8,1,172.875,64.41,56.24545388,-8.16454612,42,20,0,38,0,0,0,0,0,1,0,0,1,0,0,0,0,0,1,0,1,3,0,0,0,0,0,1,0,0,0,0,1,0,1,2,,197,0,2.346679688,1.797363281,1.364990234,0.571899414,0.549316406,0.79296875
816,0,0,,,,125,87,0,33,0,16,5,9,2,180.09375,64.41,77.56429527,13.15429527,42,30,-10,16,0,0,0,0,0,0,0,0,0,0,0,0,0,0,1,0,1,2,0,0,0,0,0,0,0,0,0,0,0,0,2,2,,196,0,2.346679688,1.797363281,1.364990234,0.571899414,0.549316406,0.79296875
818,0,0,,,,131,82,0,41,0,21,2,15,4,182.28125,74.05,74.84274105,0.79274105,42,60,0,21,0,0,0,0,0,0,1,0,0,1,0,0,0,0,1,2,3,1,0,0,1,0,1,0,0,0,1,0,0,1,1,2,,269,0,2.346679688,1.797363281,1.364990234,0.571899414,0.549316406,0.79296875
825,0,1,91,2,13,156,92,0,52,0,20,2,12,3,184.78125,96.39,95.2543977,-1.1356023,42,30,-27,35,0,1,0,0,1,0,0,0,1,0,0,0,0,0,1,0,1,4,0,1,1,0,0,0,0,0,0,0,0,2,1,2,,264,0,2.346679688,1.797363281,1.364990234,0.571899414,0.549316406,0.79296875
828,1,1,85,1,22,126,83,0,57,0,,2,12,3,164.78125,81.87,76.20351816,-5.66648184,18,7,-7,35,0,0,0,0,1,0,0,0,0,0,0,0,0,0,1,2,3,1,0,1,0,0,0,0,0,1,0,0,0,2,2,2,,261,0,1.706298828,1.665283203,0.734985352,0.406982422,0.040893555,0.327941895
831,0,0,,,,112,71,0,35,0,21,2,12,3,173.09375,70.76,79.37866475,8.61866475,42,30,-10,16,0,0,0,0,0,0,0,0,0,0,0,0,0,0,1,0,3,4,0,1,0,0,0,0,0,0,0,0,0,0,1,2,,196,0,2.346679688,1.797363281,1.364990234,0.571899414,0.549316406,0.79296875
1094,0,0,,,,113,74,1,41,0,18,5,17,5,166.1875,58.17,64.41011654,6.24011654,36,1,2,21,0,0,0,0,0,0,0,0,0,0,0,0,0,0,1,2,3,2,0,0,0,0,0,0,0,0,0,0,0,1,0,0,2,183,0,2.241699219,1.828125,1.049804688,0.505981445,0.413574219,0.543945313
1096,1,1,84,10,17,127,56,1,72,0,12,3,10,2,165.5,71.21,66.67807839,-4.53192161,25,20,-20,40,0,0,0,0,0,0,0,0,0,0,0,0,0,0,1,1,3,2,0,0,0,0,0,0,0,0,0,0,0,1,2,0,4,260,1,2.414550781,1.951171875,1.259765625,0.637939453,0.463562012,0.621948242
1101,0,0,,,,115,68,0,33,0,18,2,16,5,175,82.44,75.74992579,-6.69007421,25,20,0,14,0,0,0,0,0,0,0,0,0,0,0,0,0,0,1,3,4,,0,1,0,0,0,0,0,0,0,0,0,1,1,2,,182,1,2.414550781,1.951171875,1.259765625,0.637939453,0.463562012,0.621948242
1103,0,0,,,,122,68,1,34,0,20,2,12,3,168.1875,61.23,65.77089365,4.54089365,25,20,10,15,0,0,0,0,0,0,0,0,0,0,0,0,0,0,1,2,3,3,0,1,0,0,0,0,0,0,0,0,0,0,0,0,5,135,1,2.414550781,1.951171875,1.259765625,0.637939453,0.463562012,0.621948242
1104,1,0,,,,140,88,1,35,0,20,2,12,3,161.1875,44.23,64.41011654,20.18011654,11,15,-15,22,0,0,0,0,0,0,0,0,0,0,0,0,0,0,1,3,4,,0,1,0,0,0,0,0,0,0,0,0,1,2,0,5,171,0,1.769287109,1.8984375,0.629882813,0.461975098,-0.129272461,0.167999268
1106,0,0,,,,116,85,1,28,0,20,2,16,5,167,56.47,59.42060047,2.95060047,25,30,10,10,0,0,0,0,0,0,0,0,0,0,0,0,0,0,1,2,3,3,0,1,0,0,0,0,0,0,0,0,0,1,1,1,3,203,1,2.414550781,1.951171875,1.259765625,0.637939453,0.463562012,0.621948242
1109,0,0,,,,137,90,0,26,0,19,5,16,5,178.78125,70.87,79.37866475,8.50866475,9,35,-5,10,0,0,0,0,0,0,0,0,0,0,0,0,0,0,1,0,1,6,0,0,0,0,0,0,0,0,0,0,0,2,0,2,,307,1,2.692871094,2.103027344,1.522460938,0.637939453,0.590087891,0.884399414
1116,0,0,,,,130,71,0,64,0,18,2,12,3,178,79.15,78.92507238,-0.22492762,25,17,-2,44,0,1,0,0,0,0,0,0,0,0,0,0,1,0,1,2,3,2,0,0,0,0,0,0,0,0,0,0,0,1,0,2,,262,1,2.414550781,1.951171875,1.259765625,0.637939453,0.463562012,0.621948242
1120,0,0,,,,167,93,0,35,0,18,2,10,2,173.28125,85.62,84.82177319,-0.79822681,25,30,10,21,0,0,0,0,0,0,0,0,0,0,0,0,0,0,1,1,1,12,0,1,1,0,0,0,0,0,0,0,0,0,0,2,,222,1,2.414550781,1.951171875,1.259765625,0.637939453,0.463562012,0.621948242
1124,1,1,89,8,26,177,79,1,63,0,18,3,12,3,163.875,39.58,39.91612856,0.33612856,25,20,-20,43,0,1,0,0,0,0,0,0,0,0,0,0,0,0,0,4,4,,0,1,0,0,0,0,0,0,0,0,0,1,1,0,1,251,1,2.414550781,1.951171875,1.259765625,0.637939453,0.463562012,0.621948242
1126,0,0,,,,121,80,1,45,0,18,2,12,3,153.875,63.84,66.22448602,2.38448602,25,3,2,26,0,0,0,0,0,0,0,0,0,0,0,0,0,0,1,3,4,,0,0,1,0,0,0,0,0,0,0,0,0,2,0,5,202,1,2.414550781,1.951171875,1.259765625,0.637939453,0.463562012,0.621948242
1127,0,0,,,,,,0,40,0,20,2,17,5,176.875,72.12,,,34,60,-20,22,0,0,0,0,0,0,0,0,1,1,0,0,0,0,1,1,1,2,0,1,1,0,0,0,0,0,0,0,0,2,2,2,,307,1,2.209960938,2.025878906,1.154785156,0.747924805,0.184082031,0.406982422
1129,0,1,88,10,4,142,62,1,69,0,15,2,8,1,156.6875,67.59,68.0388555,0.4488555,25,20,0,29,0,0,0,0,0,0,0,0,0,0,0,0,0,0,1,3,4,,0,1,0,0,0,0,0,0,0,0,0,1,2,0,7,199,1,2.414550781,1.951171875,1.259765625,0.637939453,0.463562012,0.621948242
1133,0,0,,,,121,79,0,33,0,20,2,17,5,182.28125,74.5,79.37866475,4.87866475,39,20,0,12,0,0,0,0,0,0,0,0,0,0,0,0,0,0,1,0,1,2,0,1,0,0,0,0,0,0,0,0,0,1,0,2,,181,0,2.015625,1.814941406,0.944946289,0.483947754,0.20098877,0.460998535
1135,0,0,,,,183,101,0,45,0,20,2,12,3,170.6875,66.79,79.83225712,13.04225712,25,40,-20,28,0,0,0,0,1,0,0,0,0,0,0,0,0,0,1,0,1,5,0,1,0,0,0,0,0,0,0,0,0,0,2,2,,274,1,2.414550781,1.951171875,1.259765625,0.637939453,0.463562012,0.621948242
1148,0,0,,,,150,90,1,37,1,22,2,11,2,160.09375,66.56,68.49244787,1.93244787,25,3,2,9,0,0,0,0,0,0,0,0,0,0,0,0,0,0,1,3,1,1,0,1,0,0,0,0,0,0,0,0,0,0,2,0,,258,1,2.414550781,1.951171875,1.259765625,0.637939453,0.463562012,0.621948242
1476,1,1,83,8,1,,,0,49,1,18,2,10,2,184.28125,119.18,133.3561568,14.17615678,28,2,-2,32,0,0,0,0,1,0,0,0,0,0,0,0,0,0,1,0,3,2,0,0,0,0,0,0,0,0,0,0,0,1,2,2,,331,0,1.963378906,1.729003906,0.892456055,0.41796875,0.234283447,0.474487305
1480,0,0,,,,119,71,0,51,1,20,2,12,3,165,76.09,77.1107029,1.0207029,47,10,-6,23,0,1,0,0,0,0,0,0,0,0,0,0,0,0,1,1,1,3,0,0,0,0,0,0,0,0,0,0,0,0,2,2,,223,0,2.18359375,1.739990234,1.102294922,0.461975098,0.443786621,0.640380859
1498,0,0,,,,105,60,1,28,0,19,2,10,2,167.1875,54.66,60.78137758,6.12137758,26,20,-5,12,0,0,0,0,0,0,0,0,0,0,0,0,0,0,1,3,4,,0,1,0,0,0,0,0,0,0,0,0,1,0,1,8,180,1,2.099609375,1.929199219,0.997436523,0.637939453,0.170593262,0.35949707
1505,0,0,,,,117,78,1,36,1,13,2,12,3,158.6875,68.49,68.0388555,-0.4511445,39,20,0,14,0,0,0,0,0,0,0,0,0,0,0,0,0,0,1,1,1,4,0,1,0,0,0,0,0,0,0,0,0,0,1,0,5,113,0,2.015625,1.814941406,0.944946289,0.483947754,0.20098877,0.460998535
1513,0,1,85,8,3,140,86,0,45,1,20,2,12,3,175.28125,71.44,83.91458845,12.47458845,47,15,0,28,0,0,0,0,0,0,0,0,0,0,0,0,0,0,1,0,1,6,0,0,1,0,0,0,0,0,0,0,0,0,2,2,,208,0,2.18359375,1.739990234,1.102294922,0.461975098,0.443786621,0.640380859
1515,0,0,,,,121,90,1,47,1,19,2,11,2,159.6875,48.53,49.8951607,1.3651607,1,8,-2,26,0,0,0,0,0,0,0,0,0,0,0,0,0,0,1,2,1,2,0,1,1,0,0,0,0,0,0,0,0,1,2,0,4,185,0,2.220703125,1.856689453,1.049804688,0.527954102,0.363952637,0.521972656
1519,0,0,,,,127,83,1,57,1,18,2,10,2,149.78125,63.96,54.88467677,-9.07532323,22,20,-19,20,0,1,0,0,1,0,0,0,0,0,0,0,0,0,1,2,1,2,0,1,1,0,0,0,1,1,1,0,0,0,1,0,,263,0,2.099609375,1.775390625,0.997436523,0.41796875,0.324584961,0.579467773
1523,0,0,,,,155,91,1,57,1,,2,9,2,157,73.94,67.13167076,-6.80832924,47,15,-6,39,0,0,0,0,0,0,0,0,0,0,0,0,0,0,1,0,3,1,0,0,1,0,0,0,0,0,0,0,0,0,2,0,,259,0,2.18359375,1.739990234,1.102294922,0.461975098,0.443786621,0.640380859
1535,0,0,,,,116,70,1,35,0,18,2,8,1,162.6875,52.96,52.61671492,-0.34328508,51,10,0,24,0,0,0,0,1,0,0,0,0,0,0,0,0,0,0,4,4,,0,0,0,0,0,0,0,0,0,0,0,0,2,1,5,182,0,1.569580078,1.513427734,0.551269531,0.230987549,0.05619812,0.320251465
1538,1,0,,,,160,83,0,50,0,20,2,10,2,183.1875,88.45,90.26488163,1.81488163,26,30,-30,34,0,0,0,0,0,1,0,0,0,0,0,0,0,0,1,2,3,6,0,0,0,0,0,0,0,0,0,0,0,0,0,2,,250,1,2.099609375,1.929199219,0.997436523,0.637939453,0.170593262,0.35949707
1539,0,1,92,3,23,125,70,1,56,0,19,2,8,1,153.875,49.9,58.9670081,9.0670081,26,40,0,34,0,0,0,0,0,1,0,0,0,0,0,0,0,0,1,0,1,1,0,1,0,0,0,0,0,0,0,0,0,0,1,0,3,181,1,2.099609375,1.929199219,0.997436523,0.637939453,0.170593262,0.35949707
1542,0,0,,,,116,75,1,55,1,,3,7,1,167,78.93,81.19303423,2.26303423,51,10,5,26,0,0,0,0,0,0,0,0,0,0,1,0,0,0,1,1,3,4,0,1,0,0,0,0,0,0,1,0,0,0,2,0,2,343,0,1.569580078,1.513427734,0.551269531,0.230987549,0.05619812,0.320251465
1753,1,0,,,,,,0,27,0,18,2,16,5,175.28125,70.31,,,34,20,-20,12,0,0,0,0,0,0,0,0,0,0,0,0,0,0,1,1,1,2,0,1,0,0,0,0,0,0,0,0,0,1,1,2,,386,1,2.209960938,2.025878906,1.154785156,0.747924805,0.184082031,0.406982422
1762,0,1,87,8,29,176,108,1,64,0,19,2,15,4,155.09375,48.53,43.09127515,-5.43872485,50,10,2,38,0,0,0,0,1,0,1,0,0,0,0,0,0,0,1,0,3,1,0,1,1,0,0,0,0,0,1,0,0,1,1,0,3,306,0,2.099609375,1.693847656,1.049804688,0.439941406,0.405944824,0.609985352
1769,0,0,,,,110,75,1,25,1,18,6,12,3,158.375,50.8,88.45051215,37.65051215,18,30,0,7,0,0,0,0,0,0,0,0,0,0,0,0,0,0,1,0,1,2,1,1,0,0,0,1,0,0,1,0,1,0,2,0,1,232,0,1.706298828,1.665283203,0.734985352,0.406982422,0.040893555,0.327941895
1776,0,1,90,11,24,155,70,1,32,1,15,2,9,2,164.78125,77,92.53284348,15.53284348,37,10,0,14,0,0,0,0,0,0,0,0,0,0,0,0,0,0,1,2,1,9,0,1,0,0,0,0,0,0,0,0,0,0,2,0,3,126,0,1.506591797,1.451904297,0.524902344,0.219970703,0.054794312,0.304992676
1778,1,0,,,,133,85,0,34,1,18,2,11,2,171.5,68.83,74.38914868,5.55914868,13,20,-20,13,0,0,0,0,0,0,0,0,0,0,0,0,0,0,1,0,1,8,0,0,0,0,0,0,0,0,0,0,0,1,1,2,,213,0,2.146972656,1.735595703,1.049804688,0.439941406,0.411499023,0.609985352
1781,0,1,85,12,16,109,67,0,36,0,18,2,8,1,161.59375,67.36,70.76040972,3.40040972,,40,10,21,0,0,0,0,0,0,0,0,0,0,0,0,0,0,1,1,1,6,0,1,0,0,0,0,0,0,0,0,0,0,1,2,,222,,,,,,,
1789,1,0,,,,121,84,0,34,0,19,2,16,5,185.59375,109.09,108.4085764,-0.68142357,34,30,-30,26,0,0,0,0,1,0,0,0,0,0,0,0,0,0,1,0,1,12,0,1,0,0,0,0,0,1,0,0,0,2,0,2,,212,1,2.209960938,2.025878906,1.154785156,0.747924805,0.184082031,0.406982422
1793,0,0,,,,165,91,1,40,1,,2,8,1,151.59375,86.64,81.6466266,-4.9933734,,30,-16,15,0,0,0,0,0,0,0,0,1,1,0,0,0,0,1,2,3,3,0,0,1,0,0,0,0,0,0,0,0,1,2,0,11,200,,,,,,,
1936,0,0,,,,128,62,1,47,0,,3,10,2,161.875,48.76,49.8951607,1.1351607,42,30,-10,24,0,0,0,0,1,0,1,0,0,0,0,0,0,0,1,2,3,2,0,1,0,0,0,1,0,1,0,0,0,0,2,1,1,166,0,2.346679688,1.797363281,1.364990234,0.571899414,0.549316406,0.79296875
1938,1,0,,,,140,73,1,54,0,18,4,9,2,157.78125,57.38,62.59574706,5.21574706,25,20,-20,36,0,0,0,0,0,0,0,0,0,0,0,0,0,0,1,0,1,3,0,0,0,0,0,0,0,0,0,0,0,0,0,0,,218,1,2.414550781,1.951171875,1.259765625,0.637939453,0.463562012,0.621948242
1939,0,0,,,,115,70,1,35,0,20,2,12,3,165.78125,56.25,56.69904625,0.44904625,36,5,15,2,0,0,0,0,0,0,1,0,0,0,0,0,0,0,1,1,2,1,0,1,1,0,0,0,0,0,1,0,0,0,2,1,9,226,0,2.241699219,1.828125,1.049804688,0.505981445,0.413574219,0.543945313
1941,0,0,,,,,,1,48,0,16,3,12,3,159.1875,75.86,98.88313666,23.02313666,25,20,0,23,0,0,0,0,0,0,0,0,0,0,0,0,0,0,0,4,4,,0,0,0,0,0,0,0,0,0,0,0,0,2,0,6,186,1,2.414550781,1.951171875,1.259765625,0.637939453,0.463562012,0.621948242
1943,0,0,,,,134,90,0,33,0,13,2,7,1,177.875,72.12,77.1107029,4.9907029,25,20,0,21,0,0,0,0,0,0,0,0,0,0,0,0,0,0,1,0,1,3,0,1,0,0,0,0,0,0,0,0,0,0,0,2,,174,1,2.414550781,1.951171875,1.259765625,0.637939453,0.463562012,0.621948242
1945,1,1,89,3,6,140,74,1,70,0,12,3,9,2,150.1875,84.48,,,25,10,-10,36,0,0,0,0,0,0,0,0,0,0,0,0,0,0,1,3,3,2,0,1,0,0,0,0,0,0,0,0,0,1,2,0,6,255,1,2.414550781,1.951171875,1.259765625,0.637939453,0.463562012,0.621948242
1951,0,0,,1,10,124,61,0,67,0,18,2,9,2,164.375,56.02,51.70953018,-4.31046982,25,20,-19,55,0,0,0,0,0,0,0,0,0,0,0,0,0,0,1,0,3,1,0,0,0,0,0,1,0,0,0,0,0,2,1,2,,207,1,2.414550781,1.951171875,1.259765625,0.637939453,0.463562012,0.621948242
1964,0,0,,,,114,74,1,32,0,18,2,12,3,169.1875,53.86,56.24545388,2.38545388,25,3,4,12,0,0,0,0,0,0,0,0,0,1,0,0,0,0,1,3,4,,0,1,1,0,1,0,0,0,0,0,0,1,2,1,6,270,1,2.414550781,1.951171875,1.259765625,0.637939453,0.463562012,0.621948242
1967,0,0,,,,102,76,1,37,0,21,2,12,3,155.5,50.69,54.4310844,3.7410844,25,20,0,20,0,0,0,0,0,0,0,0,0,0,0,0,0,0,1,0,3,2,0,1,0,0,1,0,1,0,0,0,0,1,1,0,,195,1,2.414550781,1.951171875,1.259765625,0.637939453,0.463562012,0.621948242
1968,0,1,85,9,11,142,69,0,65,0,16,2,12,3,179,69.63,69.39963261,-0.23036739,25,5,0,47,0,0,0,0,1,0,0,0,0,0,0,0,0,0,1,0,3,1,0,1,0,1,0,0,0,0,1,0,0,1,1,2,,244,1,2.414550781,1.951171875,1.259765625,0.637939453,0.463562012,0.621948242
2246,0,1,91,2,6,,,0,26,1,11,4,12,3,173.375,169.19,,,39,5,-5,8,0,0,0,0,1,0,0,0,0,0,0,0,0,0,0,4,4,,0,1,1,0,0,0,0,0,0,0,0,1,2,2,,209,0,2.015625,1.814941406,0.944946289,0.483947754,0.20098877,0.460998535
2248,0,0,,,,152,82,1,51,1,18,3,10,2,165.78125,62.71,72.5747792,9.8647792,5,6,9,16,0,0,0,0,0,0,0,0,0,0,0,0,0,0,1,3,4,,0,1,0,0,0,1,0,0,0,0,0,0,1,0,2,228,0,2.314941406,1.803955078,1.351806641,0.56640625,0.511230469,0.78527832
2249,0,0,,,,140,80,0,33,1,18,3,15,4,188.28125,80.97,86.1825503,5.2125503,28,10,0,17,0,0,0,0,0,0,0,0,0,0,0,0,0,0,1,2,1,3,0,1,0,0,0,0,0,0,0,0,0,0,0,2,,222,0,1.963378906,1.729003906,0.892456055,0.41796875,0.234283447,0.474487305
2251,0,0,,,,124,103,0,34,1,18,2,12,3,163,67.13,73.48196394,6.35196394,39,20,-12,18,0,0,0,0,0,0,0,0,0,1,0,0,0,0,0,4,4,,0,0,0,0,0,0,1,0,0,0,0,0,1,2,,200,0,2.015625,1.814941406,0.944946289,0.483947754,0.20098877,0.460998535
2254,0,0,,,,137,77,1,53,0,17,4,10,2,161,81.42,60.32778521,-21.09221479,39,6,-1,24,0,0,0,0,0,0,0,0,0,0,0,0,0,0,1,3,4,,0,0,0,0,0,0,0,0,0,0,0,1,2,0,,252,0,2.015625,1.814941406,0.944946289,0.483947754,0.20098877,0.460998535
2255,0,0,,,,124,75,0,56,0,20,2,10,2,183.78125,88.68,95.2543977,6.5743977,39,20,10,49,0,0,0,0,1,0,0,0,0,0,0,0,0,1,0,4,4,,0,1,0,0,0,0,0,0,0,0,0,0,1,2,,207,0,2.015625,1.814941406,0.944946289,0.483947754,0.20098877,0.460998535
2259,0,0,,,,117,78,1,37,0,19,2,12,3,170.59375,74.16,68.49244787,-5.66755213,39,20,0,16,0,0,0,0,0,0,0,0,0,1,0,0,0,0,0,4,4,,0,0,1,0,1,1,0,0,0,0,1,1,2,0,9,206,0,2.015625,1.814941406,0.944946289,0.483947754,0.20098877,0.460998535
2260,1,0,,,,124,80,1,45,1,18,5,9,2,163.78125,89.47,90.26488163,0.79488163,,5,-5,30,0,0,0,0,0,0,0,0,0,0,0,0,0,0,1,0,3,2,0,1,1,0,1,0,0,0,1,1,0,0,1,0,5,144,,,,,,,
2263,0,0,,,,128,76,0,55,1,18,2,11,2,173.375,76.88,69.39963261,-7.48036739,12,20,20,39,0,0,0,0,0,0,0,0,0,0,0,0,0,0,1,1,3,2,0,0,0,0,0,0,0,0,1,0,0,0,1,2,,188,1,2.456542969,1.990966797,1.3125,0.637939453,0.465942383,0.674438477
2267,0,0,,,,137,72,0,59,1,19,2,11,2,184.375,111.81,99.7903214,-12.0196786,42,40,0,40,0,0,0,0,1,0,0,0,0,1,0,0,0,0,1,0,3,2,0,0,0,0,0,0,0,0,0,0,0,1,1,2,,255,0,2.346679688,1.797363281,1.364990234,0.571899414,0.549316406,0.79296875
2273,0,0,,,,109,71,1,36,0,20,2,12,3,158.5,57.95,58.9670081,1.0170081,39,30,0,17,0,0,0,0,0,0,0,0,0,0,0,0,0,0,1,2,3,4,0,0,0,0,0,0,0,0,0,0,0,1,1,0,,202,0,2.015625,1.814941406,0.944946289,0.483947754,0.20098877,0.460998535
2279,0,0,,,,156,60,1,35,0,20,4,12,3,173,71.44,75.29633342,3.85633342,39,12,18,17,0,0,0,0,0,0,0,0,0,0,0,0,0,0,1,3,3,2,0,1,0,0,0,0,0,0,0,0,0,2,1,0,,189,0,2.015625,1.814941406,0.944946289,0.483947754,0.20098877,0.460998535
2281,0,0,,,,123,85,1,39,0,19,2,12,3,172.78125,52.73,50.80234544,-1.92765456,,20,0,20,0,0,0,0,0,0,0,0,0,0,0,0,0,0,1,3,1,2,0,1,0,0,0,0,0,0,0,0,0,0,1,0,3,223,,,,,,,
2284,1,0,,,,116,80,1,30,0,18,2,12,3,168.375,65.54,81.19303423,15.65303423,39,13,-13,9,0,0,0,0,0,0,0,0,0,0,0,0,0,0,1,3,3,2,0,1,0,0,0,0,0,0,0,1,0,1,1,0,3,247,0,2.015625,1.814941406,0.944946289,0.483947754,0.20098877,0.460998535
2285,0,0,,,,129,79,1,32,1,13,6,9,2,164.375,56.47,63.5029318,7.0329318,39,10,-7,16,0,0,0,0,0,0,0,0,0,0,0,0,0,1,1,3,2,2,1,1,0,0,0,1,0,0,0,0,0,0,1,0,5,156,0,2.015625,1.814941406,0.944946289,0.483947754,0.20098877,0.460998535
2286,0,1,87,8,24,132,88,1,45,1,12,2,12,3,161.59375,58.29,58.51341573,0.22341573,26,8,2,26,0,0,0,0,0,0,0,0,1,0,0,0,0,0,1,2,1,2,0,0,0,0,0,0,0,0,1,0,0,1,0,0,4,191,1,2.099609375,1.929199219,0.997436523,0.637939453,0.170593262,0.35949707
2287,0,0,,,,121,72,1,55,0,11,3,10,2,163.1875,66.9,59.42060047,-7.47939953,39,25,-5,40,0,0,0,0,0,0,0,0,0,0,0,0,0,0,1,2,3,3,0,0,1,0,0,0,0,0,0,0,0,2,2,0,2,343,0,2.015625,1.814941406,0.944946289,0.483947754,0.20098877,0.460998535
2289,1,1,85,6,8,126,80,0,49,1,11,6,0,1,177.78125,89.24,85.72895793,-3.51104207,45,10,-10,34,0,0,1,0,0,0,0,0,0,0,0,0,0,0,1,3,4,,0,1,1,0,0,0,0,0,0,0,0,1,1,2,,160,0,1.790283203,1.592773438,0.734985352,0.329956055,0.197479248,0.404968262
2290,0,0,,,,100,74,0,30,1,18,6,11,2,178.375,93.67,108.4085764,14.73857643,39,20,20,14,0,0,0,0,0,0,0,0,0,0,0,0,0,0,1,2,3,12,0,1,0,0,0,0,0,0,0,0,0,0,0,2,,202,0,2.015625,1.814941406,0.944946289,0.483947754,0.20098877,0.460998535
2293,0,0,,,,120,72,0,51,0,19,2,12,3,173.5,67.13,65.77089365,-1.35910635,39,20,-16,33,0,0,0,0,0,0,0,0,0,0,1,0,0,0,0,4,4,,0,1,0,0,0,0,0,0,0,0,0,1,1,2,,159,0,2.015625,1.814941406,0.944946289,0.483947754,0.20098877,0.460998535
2295,0,1,91,11,19,138,68,1,49,0,17,5,10,2,162.78125,46.61,43.54486752,-3.06513248,54,12,8,32,0,1,0,0,0,0,0,0,0,0,0,0,0,0,1,3,4,,0,1,0,0,0,0,0,0,0,0,0,0,2,0,7,282,0,2.16796875,1.940185547,1.049804688,0.549926758,0.227874756,0.5
2505,1,0,,,,123,71,1,54,0,18,2,8,1,160.5,50.24,60.32778521,10.08778521,26,10,-10,34,0,0,0,0,0,0,0,0,0,0,0,0,0,0,0,4,4,,0,1,0,0,0,0,0,0,0,0,0,0,1,0,7,211,1,2.099609375,1.929199219,0.997436523,0.637939453,0.170593262,0.35949707
2507,0,0,,,,125,77,0,52,0,16,2,5,1,167.78125,74.28,67.58526313,-6.69473687,55,6,4,36,0,0,0,0,0,0,0,0,0,0,0,0,0,0,1,3,4,,0,1,1,0,0,0,0,0,1,0,0,0,0,2,,265,1,2.115722656,2.023925781,1.154785156,0.725952148,0.091796875,0.428955078
2508,1,0,,,,140,82,0,43,0,19,2,13,4,177.28125,69.29,70.30681735,1.01681735,26,1,-1,27,0,0,0,0,1,0,0,0,0,0,0,0,0,0,1,0,1,1,0,0,0,0,0,1,0,0,0,0,0,0,1,2,,221,1,2.099609375,1.929199219,0.997436523,0.637939453,0.170593262,0.35949707
2510,1,0,,,,107,67,0,35,0,19,2,12,3,180.59375,85.16,87.08973504,1.92973504,26,20,-20,17,0,0,0,0,0,0,0,0,0,0,0,0,0,0,1,0,1,4,0,0,0,0,0,0,0,0,0,0,0,0,0,2,,184,1,2.099609375,1.929199219,0.997436523,0.637939453,0.170593262,0.35949707
2511,1,0,,,,124,69,0,27,0,19,2,15,4,170.28125,106.25,118.8412009,12.59120094,26,40,-40,14,0,0,0,0,0,1,0,0,0,0,0,0,0,0,1,2,3,3,0,1,0,0,0,0,0,0,0,0,0,1,1,2,,190,1,2.099609375,1.929199219,0.997436523,0.637939453,0.170593262,0.35949707
2518,0,0,,,,113,83,1,29,0,19,2,12,3,161.875,53.18,59.87419284,6.69419284,26,30,-10,14,0,0,0,0,0,0,0,0,0,0,0,0,0,0,1,2,1,3,0,1,0,0,0,0,0,0,0,0,0,1,0,0,2,172,1,2.099609375,1.929199219,0.997436523,0.637939453,0.170593262,0.35949707